{"text_format":"3","workbook":"xlsx","n_sheets":8,"sheets":["START HERE","DASHBOARD","SALES","EXPENSES","INVOICES","CASH FLOW","CHECKS","LISTS"],"not_rendered":{"comments":2},"read":"whole","date_system":"1900"}

{"sheet":"START HERE","index":0,"n_rows":18,"n_cols":8,"rows_kept":18,"merged":[[0,0,0,7],[1,0,1,7],[3,0,3,7],[4,3,4,7],[5,3,5,7],[6,3,6,7],[7,3,7,7],[8,3,8,7],[9,3,9,7],[12,0,12,7]]}
["SMALL BUSINESS OPERATIONS PACK","SMALL BUSINESS OPERATIONS PACK","SMALL BUSINESS OPERATIONS PACK","SMALL BUSINESS OPERATIONS PACK","SMALL BUSINESS OPERATIONS PACK","SMALL BUSINESS OPERATIONS PACK","SMALL BUSINESS OPERATIONS PACK","SMALL BUSINESS OPERATIONS PACK"]
["Creative Carousel Collective • Excel Automation • Version 1.0","Creative Carousel Collective • Excel Automation • Version 1.0","Creative Carousel Collective • Excel Automation • Version 1.0","Creative Carousel Collective • Excel Automation • Version 1.0","Creative Carousel Collective • Excel Automation • Version 1.0","Creative Carousel Collective • Excel Automation • Version 1.0","Creative Carousel Collective • Excel Automation • Version 1.0","Creative Carousel Collective • Excel Automation • Version 1.0"]
[]
["1. SET UP YOUR BUSINESS","1. SET UP YOUR BUSINESS","1. SET UP YOUR BUSINESS","1. SET UP YOUR BUSINESS","1. SET UP YOUR BUSINESS","1. SET UP YOUR BUSINESS","1. SET UP YOUR BUSINESS","1. SET UP YOUR BUSINESS"]
["Business name","Brightside Studio",null,"HOW TO USE THIS PACK"]
["Owner / manager","Jordan Lee",null,"1  Replace the yellow sample inputs with your own business details."]
["Starting cash balance",{"v":25000,"d":"$25,000.00"},null,"2  Add sales, expenses, and invoices to the matching tabs."]
["Estimated tax rate",{"v":0.07,"d":"7.0%"},null,"3  Review DASHBOARD and CASH FLOW—both update automatically."]
["Currency","USD",null,"4  Keep formula columns intact. Add new rows inside the reserved areas."]
["Reporting year",2026,null,"5  Check the CHECKS tab before sharing your monthly results."]
[]
[]
["WHAT'S AUTOMATED","WHAT'S AUTOMATED","WHAT'S AUTOMATED","WHAT'S AUTOMATED","WHAT'S AUTOMATED","WHAT'S AUTOMATED","WHAT'S AUTOMATED","WHAT'S AUTOMATED"]
["Sales","Revenue totals","Expenses","Category totals","Invoices","Balances due","Cash flow","Monthly roll-forward"]
["Enter quantity + price","Calculated instantly","Enter purchases","Dashboard updates","Track payments","Status + overdue days","Starting cash","Ending cash"]
["Customer history","Monthly trend","Tax-ready records","Profit view","Due dates","Collections list","Cash in/out","12-month outlook"]
["200 entry rows","No manual totals","200 entry rows","No pivot refresh","200 entry rows","No status typing","Formula-driven","Always reconciled"]
["Yellow cells = inputs","White cells = formulas","Pink = attention","Green = healthy","Blue = navigation","Black = headings","",""]

{"sheet":"DASHBOARD","index":1,"n_rows":28,"n_cols":8,"rows_kept":28,"merged":[[0,0,0,7],[1,0,1,7],[3,0,3,1],[3,2,3,3],[3,4,3,5],[3,6,3,7],[4,0,6,1],[4,2,6,3],[4,4,6,5],[4,6,6,7]]}
["BUSINESS DASHBOARD","BUSINESS DASHBOARD","BUSINESS DASHBOARD","BUSINESS DASHBOARD","BUSINESS DASHBOARD","BUSINESS DASHBOARD","BUSINESS DASHBOARD","BUSINESS DASHBOARD"]
["Your business at a glance • Formula-driven from the entry tabs","Your business at a glance • Formula-driven from the entry tabs","Your business at a glance • Formula-driven from the entry tabs","Your business at a glance • Formula-driven from the entry tabs","Your business at a glance • Formula-driven from the entry tabs","Your business at a glance • Formula-driven from the entry tabs","Your business at a glance • Formula-driven from the entry tabs","Your business at a glance • Formula-driven from the entry tabs"]
[]
["TOTAL REVENUE",null,"TOTAL EXPENSES",null,"NET PROFIT",null,"OUTSTANDING"]
[{"$f":"SUM('SALES'!$H$6:$H$205)","v":{"v":17325,"d":"$17,325.00"}},null,{"$f":"SUM('EXPENSES'!$F$6:$F$205)","v":{"v":6335,"d":"$6,335.00"}},null,{"$f":"A5-C5","v":{"v":10990,"d":"$10,990.00"}},null,{"$f":"SUM('INVOICES'!$G$6:$G$205)","v":{"v":4325,"d":"$4,325.00"}}]
[]
[]
[]
[]
["OPERATING METRICS","VALUE"]
["Profit margin",{"$f":"IFERROR(E5/A5,0)","v":{"v":0.6343434343434343,"d":"63.4%"}}]
["Open invoices",{"$f":"COUNTIF('INVOICES'!$H$6:$H$205,\"Open\")","v":0}]
["Overdue invoices",{"$f":"COUNTIF('INVOICES'!$H$6:$H$205,\"Overdue\")","v":4}]
["Ending cash",{"$f":"'CASH FLOW'!$E$17","v":{"v":35990,"d":"$35,990.00"}}]
[]
["Month","Revenue","Expenses","Profit"]
[{"$f":"'CASH FLOW'!A6","v":"2026-01-01"},{"$f":"'CASH FLOW'!C6","v":{"v":3300,"d":"$3,300.00"}},{"$f":"'CASH FLOW'!D6","v":{"v":389,"d":"$389.00"}},{"$f":"B17-C17","v":{"v":2911,"d":"$2,911.00"}},"Jan"]
[{"$f":"'CASH FLOW'!A7","v":"2026-02-01"},{"$f":"'CASH FLOW'!C7","v":{"v":2275,"d":"$2,275.00"}},{"$f":"'CASH FLOW'!D7","v":{"v":1046,"d":"$1,046.00"}},{"$f":"B18-C18","v":{"v":1229,"d":"$1,229.00"}},"Feb"]
[{"$f":"'CASH FLOW'!A8","v":"2026-03-01"},{"$f":"'CASH FLOW'!C8","v":{"v":2225,"d":"$2,225.00"}},{"$f":"'CASH FLOW'!D8","v":{"v":940,"d":"$940.00"}},{"$f":"B19-C19","v":{"v":1285,"d":"$1,285.00"}},"Mar"]
[{"$f":"'CASH FLOW'!A9","v":"2026-04-01"},{"$f":"'CASH FLOW'!C9","v":{"v":3500,"d":"$3,500.00"}},{"$f":"'CASH FLOW'!D9","v":{"v":1550,"d":"$1,550.00"}},{"$f":"B20-C20","v":{"v":1950,"d":"$1,950.00"}},"Apr"]
{"$rows_left_out":9}
{"sheet":"SALES","index":2,"n_rows":205,"n_cols":8,"rows_kept":205,"merged":[[0,0,0,7],[1,0,1,7]]}
["SALES TRACKER","SALES TRACKER","SALES TRACKER","SALES TRACKER","SALES TRACKER","SALES TRACKER","SALES TRACKER","SALES TRACKER"]
["Enter yellow cells. Total is calculated automatically.","Enter yellow cells. Total is calculated automatically.","Enter yellow cells. Total is calculated automatically.","Enter yellow cells. Total is calculated automatically.","Enter yellow cells. Total is calculated automatically.","Enter yellow cells. Total is calculated automatically.","Enter yellow cells. Total is calculated automatically.","Enter yellow cells. Total is calculated automatically."]
[]
[]
["Date","Sale / Invoice #","Customer","Category","Description","Quantity","Unit price","Total"]
["2026-01-05","S-1001","Northstar Coffee","Services","Website refresh",1,{"v":2400,"d":"$2,400.00"},{"$f":"IF(COUNTA(A6:G6)=0,\"\",F6*G6)","v":{"v":2400,"d":"$2,400.00"}}]
["2026-01-18","S-1002","Maya Brooks","Training","Excel workflow session",2,{"v":450,"d":"$450.00"},{"$f":"IF(COUNTA(A7:G7)=0,\"\",F7*G7)","v":{"v":900,"d":"$900.00"}}]
["2026-02-03","S-1003","Greenline Dental","Consulting","Operations audit",1,{"v":1800,"d":"$1,800.00"},{"$f":"IF(COUNTA(A8:G8)=0,\"\",F8*G8)","v":{"v":1800,"d":"$1,800.00"}}]
["2026-02-21","S-1004","Cedar & Co.","Products","Dashboard template",5,{"v":95,"d":"$95.00"},{"$f":"IF(COUNTA(A9:G9)=0,\"\",F9*G9)","v":{"v":475,"d":"$475.00"}}]
["2026-03-10","S-1005","Harbor Fitness","Subscriptions","Monthly reporting",3,{"v":325,"d":"$325.00"},{"$f":"IF(COUNTA(A10:G10)=0,\"\",F10*G10)","v":{"v":975,"d":"$975.00"}}]
["2026-03-27","S-1006","Northstar Coffee","Services","Email automation",1,{"v":1250,"d":"$1,250.00"},{"$f":"IF(COUNTA(A11:G11)=0,\"\",F11*G11)","v":{"v":1250,"d":"$1,250.00"}}]
["2026-04-07","S-1007","Solace Salon","Services","Booking workflow",1,{"v":2100,"d":"$2,100.00"},{"$f":"IF(COUNTA(A12:G12)=0,\"\",F12*G12)","v":{"v":2100,"d":"$2,100.00"}}]
["2026-04-19","S-1008","Greenline Dental","Training","Team training",4,{"v":350,"d":"$350.00"},{"$f":"IF(COUNTA(A13:G13)=0,\"\",F13*G13)","v":{"v":1400,"d":"$1,400.00"}}]
["2026-05-04","S-1009","Atlas Repairs","Consulting","Process mapping",1,{"v":1650,"d":"$1,650.00"},{"$f":"IF(COUNTA(A14:G14)=0,\"\",F14*G14)","v":{"v":1650,"d":"$1,650.00"}}]
["2026-05-22","S-1010","Cedar & Co.","Licensing","Template license",10,{"v":80,"d":"$80.00"},{"$f":"IF(COUNTA(A15:G15)=0,\"\",F15*G15)","v":{"v":800,"d":"$800.00"}}]
["2026-06-09","S-1011","Harbor Fitness","Services","Dashboard build",1,{"v":2750,"d":"$2,750.00"},{"$f":"IF(COUNTA(A16:G16)=0,\"\",F16*G16)","v":{"v":2750,"d":"$2,750.00"}}]
["2026-06-24","S-1012","Solace Salon","Subscriptions","Monthly support",3,{"v":275,"d":"$275.00"},{"$f":"IF(COUNTA(A17:G17)=0,\"\",F17*G17)","v":{"v":825,"d":"$825.00"}}]
[{"$nulls":7},{"$f":"IF(COUNTA(A18:G18)=0,\"\",F18*G18)","v":""}]
[{"$nulls":7},{"$f":"IF(COUNTA(A19:G19)=0,\"\",F19*G19)","v":""}]
[{"$nulls":7},{"$f":"IF(COUNTA(A20:G20)=0,\"\",F20*G20)","v":""}]
{"$rows_left_out":186}
{"sheet":"EXPENSES","index":3,"n_rows":17,"n_cols":8,"rows_kept":17,"merged":[[0,0,0,7],[1,0,1,7]]}
["EXPENSE TRACKER","EXPENSE TRACKER","EXPENSE TRACKER","EXPENSE TRACKER","EXPENSE TRACKER","EXPENSE TRACKER","EXPENSE TRACKER","EXPENSE TRACKER"]
["Capture every business purchase in one place.","Capture every business purchase in one place.","Capture every business purchase in one place.","Capture every business purchase in one place.","Capture every business purchase in one place.","Capture every business purchase in one place.","Capture every business purchase in one place.","Capture every business purchase in one place."]
[]
[]
["Date","Vendor","Category","Description","Payment method","Amount","Receipt?","Notes"]
["2026-01-03","Adobe","Software","Creative software","Credit card",{"v":89,"d":"$89.00"},"Yes","Monthly"]
["2026-01-14","Meta","Advertising","Lead campaign","Credit card",{"v":300,"d":"$300.00"},"Yes","January campaign"]
["2026-02-01","Workspace Co.","Rent","Studio rent","Bank transfer",{"v":900,"d":"$900.00"},"Yes",""]
["2026-02-12","Office Depot","Office","Printer supplies","Debit card",{"v":146,"d":"$146.00"},"Yes",""]
["2026-03-01","Workspace Co.","Rent","Studio rent","Bank transfer",{"v":900,"d":"$900.00"},"Yes",""]
["2026-03-18","QuickBooks","Software","Accounting software","Credit card",{"v":40,"d":"$40.00"},"Yes","Monthly"]
["2026-04-01","Workspace Co.","Rent","Studio rent","Bank transfer",{"v":900,"d":"$900.00"},"Yes",""]
["2026-04-11","Contractor Group","Contractors","Design support","Bank transfer",{"v":650,"d":"$650.00"},"Yes","Project support"]
["2026-05-01","Workspace Co.","Rent","Studio rent","Bank transfer",{"v":900,"d":"$900.00"},"Yes",""]
["2026-05-16","JetBlue","Travel","Client visit","Credit card",{"v":425,"d":"$425.00"},"Yes",""]
["2026-06-01","Workspace Co.","Rent","Studio rent","Bank transfer",{"v":900,"d":"$900.00"},"Yes",""]
["2026-06-13","Hiscox","Insurance","Business insurance","Bank transfer",{"v":185,"d":"$185.00"},"Yes","Monthly"]

{"sheet":"INVOICES","index":4,"n_rows":205,"n_cols":9,"rows_kept":205,"merged":[[0,0,0,8],[1,0,1,7]]}
["INVOICE TRACKER","INVOICE TRACKER","INVOICE TRACKER","INVOICE TRACKER","INVOICE TRACKER","INVOICE TRACKER","INVOICE TRACKER","INVOICE TRACKER","INVOICE TRACKER"]
["Balances, payment status, and overdue days calculate automatically.","Balances, payment status, and overdue days calculate automatically.","Balances, payment status, and overdue days calculate automatically.","Balances, payment status, and overdue days calculate automatically.","Balances, payment status, and overdue days calculate automatically.","Balances, payment status, and overdue days calculate automatically.","Balances, payment status, and overdue days calculate automatically.","Balances, payment status, and overdue days calculate automatically."]
[]
[]
["Invoice #","Customer","Issue date","Due date","Invoice total","Amount paid","Balance","Status","Days overdue"]
["INV-1001","Northstar Coffee","2026-01-05","2026-01-20",{"v":2400,"d":"$2,400.00"},{"v":2400,"d":"$2,400.00"},{"$f":"IF(E6=\"\",\"\",MAX(E6-F6,0))","v":0},{"$f":"IF(E6=\"\",\"\",IF(G6=0,\"Paid\",IF(D6<TODAY(),\"Overdue\",\"Open\")))","v":"Paid"},{"$f":"IF(OR(D6=\"\",G6=0),0,MAX(TODAY()-D6,0))","v":0}]
["INV-1002","Greenline Dental","2026-02-03","2026-03-05",{"v":1800,"d":"$1,800.00"},{"v":1800,"d":"$1,800.00"},{"$f":"IF(E7=\"\",\"\",MAX(E7-F7,0))","v":0},{"$f":"IF(E7=\"\",\"\",IF(G7=0,\"Paid\",IF(D7<TODAY(),\"Overdue\",\"Open\")))","v":"Paid"},{"$f":"IF(OR(D7=\"\",G7=0),0,MAX(TODAY()-D7,0))","v":0}]
["INV-1003","Harbor Fitness","2026-03-10","2026-04-09",{"v":975,"d":"$975.00"},{"v":650,"d":"$650.00"},{"$f":"IF(E8=\"\",\"\",MAX(E8-F8,0))","v":{"v":325,"d":"$325.00"}},{"$f":"IF(E8=\"\",\"\",IF(G8=0,\"Paid\",IF(D8<TODAY(),\"Overdue\",\"Open\")))","v":"Overdue"},{"$f":"IF(OR(D8=\"\",G8=0),0,MAX(TODAY()-D8,0))","v":120}]
["INV-1004","Solace Salon","2026-04-07","2026-05-07",{"v":2100,"d":"$2,100.00"},{"v":1500,"d":"$1,500.00"},{"$f":"IF(E9=\"\",\"\",MAX(E9-F9,0))","v":{"v":600,"d":"$600.00"}},{"$f":"IF(E9=\"\",\"\",IF(G9=0,\"Paid\",IF(D9<TODAY(),\"Overdue\",\"Open\")))","v":"Overdue"},{"$f":"IF(OR(D9=\"\",G9=0),0,MAX(TODAY()-D9,0))","v":92}]
["INV-1005","Atlas Repairs","2026-05-04","2026-06-03",{"v":1650,"d":"$1,650.00"},0,{"$f":"IF(E10=\"\",\"\",MAX(E10-F10,0))","v":{"v":1650,"d":"$1,650.00"}},{"$f":"IF(E10=\"\",\"\",IF(G10=0,\"Paid\",IF(D10<TODAY(),\"Overdue\",\"Open\")))","v":"Overdue"},{"$f":"IF(OR(D10=\"\",G10=0),0,MAX(TODAY()-D10,0))","v":65}]
["INV-1006","Harbor Fitness","2026-06-09","2026-07-09",{"v":2750,"d":"$2,750.00"},{"v":1000,"d":"$1,000.00"},{"$f":"IF(E11=\"\",\"\",MAX(E11-F11,0))","v":{"v":1750,"d":"$1,750.00"}},{"$f":"IF(E11=\"\",\"\",IF(G11=0,\"Paid\",IF(D11<TODAY(),\"Overdue\",\"Open\")))","v":"Overdue"},{"$f":"IF(OR(D11=\"\",G11=0),0,MAX(TODAY()-D11,0))","v":29}]
[{"$nulls":6},{"$f":"IF(E12=\"\",\"\",MAX(E12-F12,0))","v":""},{"$f":"IF(E12=\"\",\"\",IF(G12=0,\"Paid\",IF(D12<TODAY(),\"Overdue\",\"Open\")))","v":""},{"$f":"IF(OR(D12=\"\",G12=0),0,MAX(TODAY()-D12,0))","v":0}]
[{"$nulls":6},{"$f":"IF(E13=\"\",\"\",MAX(E13-F13,0))","v":""},{"$f":"IF(E13=\"\",\"\",IF(G13=0,\"Paid\",IF(D13<TODAY(),\"Overdue\",\"Open\")))","v":""},{"$f":"IF(OR(D13=\"\",G13=0),0,MAX(TODAY()-D13,0))","v":0}]
[{"$nulls":6},{"$f":"IF(E14=\"\",\"\",MAX(E14-F14,0))","v":""},{"$f":"IF(E14=\"\",\"\",IF(G14=0,\"Paid\",IF(D14<TODAY(),\"Overdue\",\"Open\")))","v":""},{"$f":"IF(OR(D14=\"\",G14=0),0,MAX(TODAY()-D14,0))","v":0}]
[{"$nulls":6},{"$f":"IF(E15=\"\",\"\",MAX(E15-F15,0))","v":""},{"$f":"IF(E15=\"\",\"\",IF(G15=0,\"Paid\",IF(D15<TODAY(),\"Overdue\",\"Open\")))","v":""},{"$f":"IF(OR(D15=\"\",G15=0),0,MAX(TODAY()-D15,0))","v":0}]
[{"$nulls":6},{"$f":"IF(E16=\"\",\"\",MAX(E16-F16,0))","v":""},{"$f":"IF(E16=\"\",\"\",IF(G16=0,\"Paid\",IF(D16<TODAY(),\"Overdue\",\"Open\")))","v":""},{"$f":"IF(OR(D16=\"\",G16=0),0,MAX(TODAY()-D16,0))","v":0}]
[{"$nulls":6},{"$f":"IF(E17=\"\",\"\",MAX(E17-F17,0))","v":""},{"$f":"IF(E17=\"\",\"\",IF(G17=0,\"Paid\",IF(D17<TODAY(),\"Overdue\",\"Open\")))","v":""},{"$f":"IF(OR(D17=\"\",G17=0),0,MAX(TODAY()-D17,0))","v":0}]
[{"$nulls":6},{"$f":"IF(E18=\"\",\"\",MAX(E18-F18,0))","v":""},{"$f":"IF(E18=\"\",\"\",IF(G18=0,\"Paid\",IF(D18<TODAY(),\"Overdue\",\"Open\")))","v":""},{"$f":"IF(OR(D18=\"\",G18=0),0,MAX(TODAY()-D18,0))","v":0}]
[{"$nulls":6},{"$f":"IF(E19=\"\",\"\",MAX(E19-F19,0))","v":""},{"$f":"IF(E19=\"\",\"\",IF(G19=0,\"Paid\",IF(D19<TODAY(),\"Overdue\",\"Open\")))","v":""},{"$f":"IF(OR(D19=\"\",G19=0),0,MAX(TODAY()-D19,0))","v":0}]
[{"$nulls":6},{"$f":"IF(E20=\"\",\"\",MAX(E20-F20,0))","v":""},{"$f":"IF(E20=\"\",\"\",IF(G20=0,\"Paid\",IF(D20<TODAY(),\"Overdue\",\"Open\")))","v":""},{"$f":"IF(OR(D20=\"\",G20=0),0,MAX(TODAY()-D20,0))","v":0}]
{"$rows_left_out":186}
{"sheet":"CASH FLOW","index":5,"n_rows":17,"n_cols":8,"rows_kept":17,"merged":[[0,0,0,4],[1,0,1,7]]}
["12-MONTH CASH FLOW","12-MONTH CASH FLOW","12-MONTH CASH FLOW","12-MONTH CASH FLOW","12-MONTH CASH FLOW"]
["Monthly cash in, cash out, and ending balance update from your trackers.","Monthly cash in, cash out, and ending balance update from your trackers.","Monthly cash in, cash out, and ending balance update from your trackers.","Monthly cash in, cash out, and ending balance update from your trackers.","Monthly cash in, cash out, and ending balance update from your trackers.","Monthly cash in, cash out, and ending balance update from your trackers.","Monthly cash in, cash out, and ending balance update from your trackers.","Monthly cash in, cash out, and ending balance update from your trackers."]
[]
[]
["Month","Starting cash","Cash in","Cash out","Ending cash"]
[{"$f":"DATE('START HERE'!$B$10,1,1)","v":"2026-01-01"},{"$f":"'START HERE'!$B$7","v":{"v":25000,"d":"$25,000.00"}},{"$f":"SUMIFS('SALES'!$H$6:$H$205,'SALES'!$A$6:$A$205,\">=\"&A6,'SALES'!$A$6:$A$205,\"<\"&EDATE(A6,1))","v":{"v":3300,"d":"$3,300.00"}},{"$f":"SUMIFS('EXPENSES'!$F$6:$F$205,'EXPENSES'!$A$6:$A$205,\">=\"&A6,'EXPENSES'!$A$6:$A$205,\"<\"&EDATE(A6,1))","v":{"v":389,"d":"$389.00"}},{"$f":"B6+C6-D6","v":{"v":27911,"d":"$27,911.00"}}]
[{"$f":"EDATE(A6,1)","v":"2026-02-01"},{"$f":"E6","v":{"v":27911,"d":"$27,911.00"}},{"$f":"SUMIFS('SALES'!$H$6:$H$205,'SALES'!$A$6:$A$205,\">=\"&A7,'SALES'!$A$6:$A$205,\"<\"&EDATE(A7,1))","v":{"v":2275,"d":"$2,275.00"}},{"$f":"SUMIFS('EXPENSES'!$F$6:$F$205,'EXPENSES'!$A$6:$A$205,\">=\"&A7,'EXPENSES'!$A$6:$A$205,\"<\"&EDATE(A7,1))","v":{"v":1046,"d":"$1,046.00"}},{"$f":"B7+C7-D7","v":{"v":29140,"d":"$29,140.00"}}]
[{"$f":"EDATE(A7,1)","v":"2026-03-01"},{"$f":"E7","v":{"v":29140,"d":"$29,140.00"}},{"$f":"SUMIFS('SALES'!$H$6:$H$205,'SALES'!$A$6:$A$205,\">=\"&A8,'SALES'!$A$6:$A$205,\"<\"&EDATE(A8,1))","v":{"v":2225,"d":"$2,225.00"}},{"$f":"SUMIFS('EXPENSES'!$F$6:$F$205,'EXPENSES'!$A$6:$A$205,\">=\"&A8,'EXPENSES'!$A$6:$A$205,\"<\"&EDATE(A8,1))","v":{"v":940,"d":"$940.00"}},{"$f":"B8+C8-D8","v":{"v":30425,"d":"$30,425.00"}}]
[{"$f":"EDATE(A8,1)","v":"2026-04-01"},{"$f":"E8","v":{"v":30425,"d":"$30,425.00"}},{"$f":"SUMIFS('SALES'!$H$6:$H$205,'SALES'!$A$6:$A$205,\">=\"&A9,'SALES'!$A$6:$A$205,\"<\"&EDATE(A9,1))","v":{"v":3500,"d":"$3,500.00"}},{"$f":"SUMIFS('EXPENSES'!$F$6:$F$205,'EXPENSES'!$A$6:$A$205,\">=\"&A9,'EXPENSES'!$A$6:$A$205,\"<\"&EDATE(A9,1))","v":{"v":1550,"d":"$1,550.00"}},{"$f":"B9+C9-D9","v":{"v":32375,"d":"$32,375.00"}}]
[{"$f":"EDATE(A9,1)","v":"2026-05-01"},{"$f":"E9","v":{"v":32375,"d":"$32,375.00"}},{"$f":"SUMIFS('SALES'!$H$6:$H$205,'SALES'!$A$6:$A$205,\">=\"&A10,'SALES'!$A$6:$A$205,\"<\"&EDATE(A10,1))","v":{"v":2450,"d":"$2,450.00"}},{"$f":"SUMIFS('EXPENSES'!$F$6:$F$205,'EXPENSES'!$A$6:$A$205,\">=\"&A10,'EXPENSES'!$A$6:$A$205,\"<\"&EDATE(A10,1))","v":{"v":1325,"d":"$1,325.00"}},{"$f":"B10+C10-D10","v":{"v":33500,"d":"$33,500.00"}}]
[{"$f":"EDATE(A10,1)","v":"2026-06-01"},{"$f":"E10","v":{"v":33500,"d":"$33,500.00"}},{"$f":"SUMIFS('SALES'!$H$6:$H$205,'SALES'!$A$6:$A$205,\">=\"&A11,'SALES'!$A$6:$A$205,\"<\"&EDATE(A11,1))","v":{"v":3575,"d":"$3,575.00"}},{"$f":"SUMIFS('EXPENSES'!$F$6:$F$205,'EXPENSES'!$A$6:$A$205,\">=\"&A11,'EXPENSES'!$A$6:$A$205,\"<\"&EDATE(A11,1))","v":{"v":1085,"d":"$1,085.00"}},{"$f":"B11+C11-D11","v":{"v":35990,"d":"$35,990.00"}}]
[{"$f":"EDATE(A11,1)","v":"2026-07-01"},{"$f":"E11","v":{"v":35990,"d":"$35,990.00"}},{"$f":"SUMIFS('SALES'!$H$6:$H$205,'SALES'!$A$6:$A$205,\">=\"&A12,'SALES'!$A$6:$A$205,\"<\"&EDATE(A12,1))","v":0},{"$f":"SUMIFS('EXPENSES'!$F$6:$F$205,'EXPENSES'!$A$6:$A$205,\">=\"&A12,'EXPENSES'!$A$6:$A$205,\"<\"&EDATE(A12,1))","v":0},{"$f":"B12+C12-D12","v":{"v":35990,"d":"$35,990.00"}}]
[{"$f":"EDATE(A12,1)","v":"2026-08-01"},{"$f":"E12","v":{"v":35990,"d":"$35,990.00"}},{"$f":"SUMIFS('SALES'!$H$6:$H$205,'SALES'!$A$6:$A$205,\">=\"&A13,'SALES'!$A$6:$A$205,\"<\"&EDATE(A13,1))","v":0},{"$f":"SUMIFS('EXPENSES'!$F$6:$F$205,'EXPENSES'!$A$6:$A$205,\">=\"&A13,'EXPENSES'!$A$6:$A$205,\"<\"&EDATE(A13,1))","v":0},{"$f":"B13+C13-D13","v":{"v":35990,"d":"$35,990.00"}}]
[{"$f":"EDATE(A13,1)","v":"2026-09-01"},{"$f":"E13","v":{"v":35990,"d":"$35,990.00"}},{"$f":"SUMIFS('SALES'!$H$6:$H$205,'SALES'!$A$6:$A$205,\">=\"&A14,'SALES'!$A$6:$A$205,\"<\"&EDATE(A14,1))","v":0},{"$f":"SUMIFS('EXPENSES'!$F$6:$F$205,'EXPENSES'!$A$6:$A$205,\">=\"&A14,'EXPENSES'!$A$6:$A$205,\"<\"&EDATE(A14,1))","v":0},{"$f":"B14+C14-D14","v":{"v":35990,"d":"$35,990.00"}}]
[{"$f":"EDATE(A14,1)","v":"2026-10-01"},{"$f":"E14","v":{"v":35990,"d":"$35,990.00"}},{"$f":"SUMIFS('SALES'!$H$6:$H$205,'SALES'!$A$6:$A$205,\">=\"&A15,'SALES'!$A$6:$A$205,\"<\"&EDATE(A15,1))","v":0},{"$f":"SUMIFS('EXPENSES'!$F$6:$F$205,'EXPENSES'!$A$6:$A$205,\">=\"&A15,'EXPENSES'!$A$6:$A$205,\"<\"&EDATE(A15,1))","v":0},{"$f":"B15+C15-D15","v":{"v":35990,"d":"$35,990.00"}}]
[{"$f":"EDATE(A15,1)","v":"2026-11-01"},{"$f":"E15","v":{"v":35990,"d":"$35,990.00"}},{"$f":"SUMIFS('SALES'!$H$6:$H$205,'SALES'!$A$6:$A$205,\">=\"&A16,'SALES'!$A$6:$A$205,\"<\"&EDATE(A16,1))","v":0},{"$f":"SUMIFS('EXPENSES'!$F$6:$F$205,'EXPENSES'!$A$6:$A$205,\">=\"&A16,'EXPENSES'!$A$6:$A$205,\"<\"&EDATE(A16,1))","v":0},{"$f":"B16+C16-D16","v":{"v":35990,"d":"$35,990.00"}}]
[{"$f":"EDATE(A16,1)","v":"2026-12-01"},{"$f":"E16","v":{"v":35990,"d":"$35,990.00"}},{"$f":"SUMIFS('SALES'!$H$6:$H$205,'SALES'!$A$6:$A$205,\">=\"&A17,'SALES'!$A$6:$A$205,\"<\"&EDATE(A17,1))","v":0},{"$f":"SUMIFS('EXPENSES'!$F$6:$F$205,'EXPENSES'!$A$6:$A$205,\">=\"&A17,'EXPENSES'!$A$6:$A$205,\"<\"&EDATE(A17,1))","v":0},{"$f":"B17+C17-D17","v":{"v":35990,"d":"$35,990.00"}}]

{"sheet":"CHECKS","index":6,"n_rows":10,"n_cols":8,"rows_kept":10,"merged":[[0,0,0,3],[1,0,1,7]]}
["MODEL CHECKS","MODEL CHECKS","MODEL CHECKS","MODEL CHECKS"]
["Review this page before sharing business results.","Review this page before sharing business results.","Review this page before sharing business results.","Review this page before sharing business results.","Review this page before sharing business results.","Review this page before sharing business results.","Review this page before sharing business results.","Review this page before sharing business results."]
[]
["MODEL STATUS",{"$f":"IF(COUNTIF(B7:B10,\"FAIL\")=0,\"PASS\",\"FAIL\")","v":"PASS"}]
[]
["Check","Status","Delta","Where to fix"]
["Cash flow roll-forward",{"$f":"IF(ABS('CASH FLOW'!E17-('START HERE'!B7+SUM('SALES'!H6:H205)-SUM('EXPENSES'!F6:F205)))<0.01,\"PASS\",\"FAIL\")","v":"PASS"},{"$f":"'CASH FLOW'!E17-('START HERE'!B7+SUM('SALES'!H6:H205)-SUM('EXPENSES'!F6:F205))","v":0},"CASH FLOW"]
["Invoice balances nonnegative",{"$f":"IF(MIN('INVOICES'!G6:G205)>=0,\"PASS\",\"FAIL\")","v":"PASS"},{"$f":"MIN('INVOICES'!G6:G205)","v":0},"INVOICES"]
["Starting cash entered",{"$f":"IF('START HERE'!B7<>\"\",\"PASS\",\"FAIL\")","v":"PASS"},0,"START HERE!B7"]
["Reporting year entered",{"$f":"IF('START HERE'!B10>2000,\"PASS\",\"FAIL\")","v":"PASS"},0,"START HERE!B10"]

{"sheet":"LISTS","index":7,"n_rows":14,"n_cols":8,"rows_kept":14,"merged":[[0,0,0,3],[1,0,1,7]]}
["LISTS & CATEGORIES","LISTS & CATEGORIES","LISTS & CATEGORIES","LISTS & CATEGORIES"]
["Edit these lists to match your business.","Edit these lists to match your business.","Edit these lists to match your business.","Edit these lists to match your business.","Edit these lists to match your business.","Edit these lists to match your business.","Edit these lists to match your business.","Edit these lists to match your business."]
[]
["Sales categories","Expense categories","Payment methods","Invoice terms"]
["Services","Advertising","Bank transfer","Due on receipt"]
["Products","Contractors","Cash","Net 7"]
["Consulting","Equipment","Check","Net 15"]
["Subscriptions","Insurance","Credit card","Net 30"]
["Training","Meals","Debit card","Net 45"]
["Licensing","Office","Digital wallet","Net 60"]
["Other","Professional fees","Other",""]
["","Rent","",""]
["","Software","",""]
["","Travel","",""]